powered by Jive Software

CharSequenceEquals.equalsCharSequence error when building smack

Smack Version : Latest master from github

When I run gradle install --info I get the error

D:\android\Smack>gradle install --info
Initialized native services in: C:\Users\aang\.gradle\native
The client will now receive all logging from the daemon (pid: 2696). The daemon log file: C:\Users\aang\.gradle\daemon\4.4.1\daemon-2696.out.log
Starting 11th build in daemon [uptime: 1 hrs 31 mins 47.528 secs, performance: 99%, no major garbage collections]
Using 8 worker leases.
Creating new cache for fileHashes, path D:\android\Smack\.gradle\4.4.1\fileHashes\fileHashes.bin, access org.gradle.cache.internal.DefaultCacheAccess@7f0842fa
Starting Build
Settings evaluated using settings file 'D:\android\Smack\settings.gradle'.
Projects loaded. Root project using build file 'D:\android\Smack\build.gradle'.
Included projects: [root project 'Smack', project ':smack-android', project ':smack-android-extensions', project ':smack-bosh', project ':smack-compression-jzlib', project ':smack-core', project ':smack-debug', project ':sma
ck-debug-slf4j', project ':smack-experimental', project ':smack-extensions', project ':smack-im', project ':smack-integration-test', project ':smack-java7', project ':smack-jingle-old', project ':smack-legacy', project ':sma
ck-omemo', project ':smack-omemo-signal', project ':smack-omemo-signal-integration-test', project ':smack-repl', project ':smack-resolver-dnsjava', project ':smack-resolver-javax', project ':smack-resolver-minidns', project
':smack-sasl-javax', project ':smack-sasl-provided', project ':smack-tcp']

> Configure project : 
Evaluating root project 'Smack' using build file 'D:\android\Smack\build.gradle'.
Creating new cache for metadata-1.1/results, path C:\Users\aang\.gradle\caches\transforms-1\metadata-1.1\results.bin, access org.gradle.cache.internal.DefaultCacheAccess@7b3f8334
Creating new cache for metadata-2.36/module-metadata, path C:\Users\aang\.gradle\caches\modules-2\metadata-2.36\module-metadata.bin, access org.gradle.cache.internal.DefaultCacheAccess@755fc975
Creating new cache for metadata-2.36/module-artifact, path C:\Users\aang\.gradle\caches\modules-2\metadata-2.36\module-artifact.bin, access org.gradle.cache.internal.DefaultCacheAccess@755fc975

> Configure project :smack-android 
Evaluating project ':smack-android' using build file 'D:\android\Smack\smack-android\build.gradle'.
The CompileOptions.bootClasspath property has been deprecated and is scheduled to be removed in Gradle 5.0. Please use the CompileOptions.bootstrapClasspath property instead.
        at build_dzuz3uui05b2lnyqu5whul1fe$_run_closure2$_closure5.doCall(D:\android\Smack\smack-android\build.gradle:26)
        (Run with --stacktrace to get the full stack trace of this deprecation warning.)

> Configure project :smack-android-extensions 
Evaluating project ':smack-android-extensions' using build file 'D:\android\Smack\smack-android-extensions\build.gradle'.

> Configure project :smack-bosh 
Evaluating project ':smack-bosh' using build file 'D:\android\Smack\smack-bosh\build.gradle'.

> Configure project :smack-compression-jzlib 
Evaluating project ':smack-compression-jzlib' using build file 'D:\android\Smack\smack-compression-jzlib\build.gradle'.

> Configure project :smack-core 
Evaluating project ':smack-core' using build file 'D:\android\Smack\smack-core\build.gradle'.

> Configure project :smack-debug 
Evaluating project ':smack-debug' using build file 'D:\android\Smack\smack-debug\build.gradle'.

> Configure project :smack-debug-slf4j 
Evaluating project ':smack-debug-slf4j' using build file 'D:\android\Smack\smack-debug-slf4j\build.gradle'.

> Configure project :smack-experimental 
Evaluating project ':smack-experimental' using build file 'D:\android\Smack\smack-experimental\build.gradle'.

> Configure project :smack-extensions 
Evaluating project ':smack-extensions' using build file 'D:\android\Smack\smack-extensions\build.gradle'.

> Configure project :smack-im 
Evaluating project ':smack-im' using build file 'D:\android\Smack\smack-im\build.gradle'.

> Configure project :smack-integration-test 
Evaluating project ':smack-integration-test' using build file 'D:\android\Smack\smack-integration-test\build.gradle'.

> Configure project :smack-java7 
Evaluating project ':smack-java7' using build file 'D:\android\Smack\smack-java7\build.gradle'.

> Configure project :smack-jingle-old 
Evaluating project ':smack-jingle-old' using build file 'D:\android\Smack\smack-jingle-old\build.gradle'.

> Configure project :smack-legacy 
Evaluating project ':smack-legacy' using build file 'D:\android\Smack\smack-legacy\build.gradle'.

> Configure project :smack-omemo 
Evaluating project ':smack-omemo' using build file 'D:\android\Smack\smack-omemo\build.gradle'.

> Configure project :smack-omemo-signal 
Evaluating project ':smack-omemo-signal' using build file 'D:\android\Smack\smack-omemo-signal\build.gradle'.

> Configure project :smack-omemo-signal-integration-test 
Evaluating project ':smack-omemo-signal-integration-test' using build file 'D:\android\Smack\smack-omemo-signal-integration-test\build.gradle'.

> Configure project :smack-repl 
Evaluating project ':smack-repl' using build file 'D:\android\Smack\smack-repl\build.gradle'.

> Configure project :smack-resolver-dnsjava 
Evaluating project ':smack-resolver-dnsjava' using build file 'D:\android\Smack\smack-resolver-dnsjava\build.gradle'.

> Configure project :smack-resolver-javax 
Evaluating project ':smack-resolver-javax' using build file 'D:\android\Smack\smack-resolver-javax\build.gradle'.

> Configure project :smack-resolver-minidns 
Evaluating project ':smack-resolver-minidns' using build file 'D:\android\Smack\smack-resolver-minidns\build.gradle'.

> Configure project :smack-sasl-javax 
Evaluating project ':smack-sasl-javax' using build file 'D:\android\Smack\smack-sasl-javax\build.gradle'.

> Configure project :smack-sasl-provided 
Evaluating project ':smack-sasl-provided' using build file 'D:\android\Smack\smack-sasl-provided\build.gradle'.

> Configure project :smack-tcp 
Evaluating project ':smack-tcp' using build file 'D:\android\Smack\smack-tcp\build.gradle'.

> Configure project : 
The ConfigurableReport.setDestination(Object) method has been deprecated and is scheduled to be removed in Gradle 5.0. Please use the method ConfigurableReport.setDestination(File) instead.
        at build_bypqjt1ll9hc0nk44qoejot08$_run_closure19$_closure100.doCall(D:\android\Smack\build.gradle:514)
        (Run with --stacktrace to get the full stack trace of this deprecation warning.)

All projects evaluated.
Selected primary task 'install' from project :
Creating new cache for annotation-processors, path D:\android\Smack\.gradle\4.4.1\fileContent\annotation-processors.bin, access org.gradle.cache.internal.DefaultCacheAccess@2dd07848
Tasks to be executed: [task ':smack-core:createVersionResource', task ':smack-core:compileJava', task ':smack-core:processResources', task ':smack-core:classes', task ':smack-core:osgiClasses', task ':smack-core:jar', task '
:smack-im:compileJava', task ':smack-im:processResources', task ':smack-im:classes', task ':smack-im:osgiClasses', task ':smack-im:jar', task ':smack-resolver-minidns:compileJava', task ':smack-resolver-minidns:processResour
ces', task ':smack-resolver-minidns:classes', task ':smack-resolver-minidns:osgiClasses', task ':smack-resolver-minidns:jar', task ':smack-sasl-provided:compileJava', task ':smack-sasl-provided:processResources', task ':smac
k-sasl-provided:classes', task ':smack-sasl-provided:osgiClasses', task ':smack-sasl-provided:jar', task ':smack-android:compileJava', task ':smack-android:processResources', task ':smack-android:classes', task ':smack-andro
id:osgiClasses', task ':smack-android:jar', task ':smack-core:javadoc', task ':smack-im:javadoc', task ':smack-resolver-minidns:javadoc', task ':smack-sasl-provided:javadoc', task ':smack-android:javadoc', task ':smack-andro
id:javadocJar', task ':smack-android:sourcesJar', task ':smack-android:compileTestJava', task ':smack-android:processTestResources', task ':smack-android:testClasses', task ':smack-android:testJar', task ':smack-android:sign
Archives', task ':smack-android:install', task ':smack-extensions:compileJava', task ':smack-extensions:processResources', task ':smack-extensions:classes', task ':smack-extensions:osgiClasses', task ':smack-extensions:jar',
 task ':smack-android-extensions:compileJava', task ':smack-android-extensions:processResources', task ':smack-android-extensions:classes', task ':smack-android-extensions:osgiClasses', task ':smack-android-extensions:jar',
task ':smack-extensions:javadoc', task ':smack-android-extensions:javadoc', task ':smack-android-extensions:javadocJar', task ':smack-android-extensions:sourcesJar', task ':smack-android-extensions:compileTestJava', task ':s
mack-android-extensions:processTestResources', task ':smack-android-extensions:testClasses', task ':smack-android-extensions:testJar', task ':smack-android-extensions:signArchives', task ':smack-android-extensions:install',
task ':smack-bosh:compileJava', task ':smack-bosh:processResources', task ':smack-bosh:classes', task ':smack-bosh:osgiClasses', task ':smack-bosh:jar', task ':smack-bosh:javadoc', task ':smack-bosh:javadocJar', task ':smack
-bosh:sourcesJar', task ':smack-bosh:compileTestJava', task ':smack-bosh:processTestResources', task ':smack-bosh:testClasses', task ':smack-bosh:testJar', task ':smack-bosh:signArchives', task ':smack-bosh:install', task ':
smack-compression-jzlib:compileJava', task ':smack-compression-jzlib:processResources', task ':smack-compression-jzlib:classes', task ':smack-compression-jzlib:osgiClasses', task ':smack-compression-jzlib:jar', task ':smack-
compression-jzlib:javadoc', task ':smack-compression-jzlib:javadocJar', task ':smack-compression-jzlib:sourcesJar', task ':smack-compression-jzlib:compileTestJava', task ':smack-compression-jzlib:processTestResources', task
':smack-compression-jzlib:testClasses', task ':smack-compression-jzlib:testJar', task ':smack-compression-jzlib:signArchives', task ':smack-compression-jzlib:install', task ':smack-core:javadocJar', task ':smack-core:sources
Jar', task ':smack-core:compileTestJava', task ':smack-core:processTestResources', task ':smack-core:testClasses', task ':smack-core:testJar', task ':smack-core:signArchives', task ':smack-core:install', task ':smack-debug:c
ompileJava', task ':smack-debug:processResources', task ':smack-debug:classes', task ':smack-debug:osgiClasses', task ':smack-debug:jar', task ':smack-debug:javadoc', task ':smack-debug:javadocJar', task ':smack-debug:source
sJar', task ':smack-debug:compileTestJava', task ':smack-debug:processTestResources', task ':smack-debug:testClasses', task ':smack-debug:testJar', task ':smack-debug:signArchives', task ':smack-debug:install', task ':smack-
debug-slf4j:compileJava', task ':smack-debug-slf4j:processResources', task ':smack-debug-slf4j:classes', task ':smack-debug-slf4j:osgiClasses', task ':smack-debug-slf4j:jar', task ':smack-debug-slf4j:javadoc', task ':smack-d
ebug-slf4j:javadocJar', task ':smack-debug-slf4j:sourcesJar', task ':smack-debug-slf4j:compileTestJava', task ':smack-debug-slf4j:processTestResources', task ':smack-debug-slf4j:testClasses', task ':smack-debug-slf4j:testJar
', task ':smack-debug-slf4j:signArchives', task ':smack-debug-slf4j:install', task ':smack-experimental:compileJava', task ':smack-experimental:processResources', task ':smack-experimental:classes', task ':smack-experimental
:osgiClasses', task ':smack-experimental:jar', task ':smack-experimental:javadoc', task ':smack-experimental:javadocJar', task ':smack-experimental:sourcesJar', task ':smack-extensions:compileTestJava', task ':smack-extensio
ns:processTestResources', task ':smack-extensions:testClasses', task ':smack-extensions:testJar', task ':smack-experimental:compileTestJava', task ':smack-experimental:processTestResources', task ':smack-experimental:testCla
sses', task ':smack-experimental:testJar', task ':smack-experimental:signArchives', task ':smack-experimental:install', task ':smack-extensions:javadocJar', task ':smack-extensions:sourcesJar', task ':smack-extensions:signAr
chives', task ':smack-extensions:install', task ':smack-im:javadocJar', task ':smack-im:sourcesJar', task ':smack-im:compileTestJava', task ':smack-im:processTestResources', task ':smack-im:testClasses', task ':smack-im:test
Jar', task ':smack-im:signArchives', task ':smack-im:install', task ':smack-resolver-javax:compileJava', task ':smack-resolver-javax:processResources', task ':smack-resolver-javax:classes', task ':smack-resolver-javax:osgiCl
asses', task ':smack-resolver-javax:jar', task ':smack-sasl-javax:compileJava', task ':smack-sasl-javax:processResources', task ':smack-sasl-javax:classes', task ':smack-sasl-javax:osgiClasses', task ':smack-sasl-javax:jar',
 task ':smack-java7:compileJava', task ':smack-java7:processResources', task ':smack-java7:classes', task ':smack-java7:osgiClasses', task ':smack-java7:jar', task ':smack-omemo:compileJava', task ':smack-omemo:processResour
ces', task ':smack-omemo:classes', task ':smack-omemo:osgiClasses', task ':smack-omemo:jar', task ':smack-tcp:compileJava', task ':smack-tcp:processResources', task ':smack-tcp:classes', task ':smack-tcp:osgiClasses', task '
:smack-tcp:jar', task ':smack-integration-test:compileJava', task ':smack-integration-test:processResources', task ':smack-integration-test:classes', task ':smack-integration-test:osgiClasses', task ':smack-integration-test:
jar', task ':smack-integration-test:startScripts', task ':smack-integration-test:distTar', task ':smack-integration-test:distZip', task ':smack-resolver-javax:javadoc', task ':smack-sasl-javax:javadoc', task ':smack-java7:ja
vadoc', task ':smack-omemo:javadoc', task ':smack-tcp:javadoc', task ':smack-integration-test:javadoc', task ':smack-integration-test:javadocJar', task ':smack-integration-test:sourcesJar', task ':smack-integration-test:comp
ileTestJava', task ':smack-integration-test:processTestResources', task ':smack-integration-test:testClasses', task ':smack-integration-test:testJar', task ':smack-integration-test:signArchives', task ':smack-integration-tes
t:install', task ':smack-java7:javadocJar', task ':smack-java7:sourcesJar', task ':smack-java7:compileTestJava', task ':smack-java7:processTestResources', task ':smack-java7:testClasses', task ':smack-java7:testJar', task ':
smack-java7:signArchives', task ':smack-java7:install', task ':smack-jingle-old:compileJava', task ':smack-jingle-old:processResources', task ':smack-jingle-old:classes', task ':smack-jingle-old:osgiClasses', task ':smack-ji
ngle-old:jar', task ':smack-jingle-old:javadoc', task ':smack-jingle-old:javadocJar', task ':smack-jingle-old:sourcesJar', task ':smack-jingle-old:compileTestJava', task ':smack-jingle-old:processTestResources', task ':smack
-jingle-old:testClasses', task ':smack-jingle-old:testJar', task ':smack-jingle-old:signArchives', task ':smack-jingle-old:install', task ':smack-legacy:compileJava', task ':smack-legacy:processResources', task ':smack-legac
y:classes', task ':smack-legacy:osgiClasses', task ':smack-legacy:jar', task ':smack-legacy:javadoc', task ':smack-legacy:javadocJar', task ':smack-legacy:sourcesJar', task ':smack-legacy:compileTestJava', task ':smack-legac
y:processTestResources', task ':smack-legacy:testClasses', task ':smack-legacy:testJar', task ':smack-legacy:signArchives', task ':smack-legacy:install', task ':smack-omemo:javadocJar', task ':smack-omemo:sourcesJar', task '
:smack-omemo:compileTestJava', task ':smack-omemo:processTestResources', task ':smack-omemo:testClasses', task ':smack-omemo:testJar', task ':smack-omemo:signArchives', task ':smack-omemo:install', task ':smack-omemo-signal:
compileJava', task ':smack-omemo-signal:processResources', task ':smack-omemo-signal:classes', task ':smack-omemo-signal:osgiClasses', task ':smack-omemo-signal:jar', task ':smack-omemo-signal:javadoc', task ':smack-omemo-si
gnal:javadocJar', task ':smack-omemo-signal:sourcesJar', task ':smack-omemo-signal:compileTestJava', task ':smack-omemo-signal:processTestResources', task ':smack-omemo-signal:testClasses', task ':smack-omemo-signal:testJar'
, task ':smack-omemo-signal:signArchives', task ':smack-omemo-signal:install', task ':smack-omemo-signal-integration-test:compileJava', task ':smack-omemo-signal-integration-test:processResources', task ':smack-omemo-signal-
integration-test:classes', task ':smack-omemo-signal-integration-test:osgiClasses', task ':smack-omemo-signal-integration-test:jar', task ':smack-omemo-signal-integration-test:startScripts', task ':smack-omemo-signal-integra
tion-test:distTar', task ':smack-omemo-signal-integration-test:distZip', task ':smack-omemo-signal-integration-test:javadoc', task ':smack-omemo-signal-integration-test:javadocJar', task ':smack-omemo-signal-integration-test
:sourcesJar', task ':smack-omemo-signal-integration-test:compileTestJava', task ':smack-omemo-signal-integration-test:processTestResources', task ':smack-omemo-signal-integration-test:testClasses', task ':smack-omemo-signal-
integration-test:testJar', task ':smack-omemo-signal-integration-test:signArchives', task ':smack-omemo-signal-integration-test:install', task ':smack-repl:compileJava', task ':smack-repl:processResources', task ':smack-repl
:classes', task ':smack-repl:osgiClasses', task ':smack-repl:jar', task ':smack-repl:javadoc', task ':smack-repl:javadocJar', task ':smack-repl:sourcesJar', task ':smack-repl:compileTestJava', task ':smack-repl:processTestRe
sources', task ':smack-repl:testClasses', task ':smack-repl:testJar', task ':smack-repl:signArchives', task ':smack-repl:install', task ':smack-resolver-dnsjava:compileJava', task ':smack-resolver-dnsjava:processResources',
task ':smack-resolver-dnsjava:classes', task ':smack-resolver-dnsjava:osgiClasses', task ':smack-resolver-dnsjava:jar', task ':smack-resolver-dnsjava:javadoc', task ':smack-resolver-dnsjava:javadocJar', task ':smack-resolver
-dnsjava:sourcesJar', task ':smack-resolver-dnsjava:compileTestJava', task ':smack-resolver-dnsjava:processTestResources', task ':smack-resolver-dnsjava:testClasses', task ':smack-resolver-dnsjava:testJar', task ':smack-reso
lver-dnsjava:signArchives', task ':smack-resolver-dnsjava:install', task ':smack-resolver-javax:javadocJar', task ':smack-resolver-javax:sourcesJar', task ':smack-resolver-javax:compileTestJava', task ':smack-resolver-javax:
processTestResources', task ':smack-resolver-javax:testClasses', task ':smack-resolver-javax:testJar', task ':smack-resolver-javax:signArchives', task ':smack-resolver-javax:install', task ':smack-resolver-minidns:javadocJar
', task ':smack-resolver-minidns:sourcesJar', task ':smack-resolver-minidns:compileTestJava', task ':smack-resolver-minidns:processTestResources', task ':smack-resolver-minidns:testClasses', task ':smack-resolver-minidns:tes
tJar', task ':smack-resolver-minidns:signArchives', task ':smack-resolver-minidns:install', task ':smack-sasl-javax:javadocJar', task ':smack-sasl-javax:sourcesJar', task ':smack-sasl-javax:compileTestJava', task ':smack-sas
l-javax:processTestResources', task ':smack-sasl-javax:testClasses', task ':smack-sasl-javax:testJar', task ':smack-sasl-javax:signArchives', task ':smack-sasl-javax:install', task ':smack-sasl-provided:javadocJar', task ':s
mack-sasl-provided:sourcesJar', task ':smack-sasl-provided:compileTestJava', task ':smack-sasl-provided:processTestResources', task ':smack-sasl-provided:testClasses', task ':smack-sasl-provided:testJar', task ':smack-sasl-p
rovided:signArchives', task ':smack-sasl-provided:install', task ':smack-tcp:javadocJar', task ':smack-tcp:sourcesJar', task ':smack-tcp:compileTestJava', task ':smack-tcp:processTestResources', task ':smack-tcp:testClasses'
, task ':smack-tcp:testJar', task ':smack-tcp:signArchives', task ':smack-tcp:install']
Creating new cache for resourceHashesCache, path D:\android\Smack\.gradle\4.4.1\fileHashes\resourceHashesCache.bin, access org.gradle.cache.internal.DefaultCacheAccess@7f0842fa
Creating new cache for taskHistory, path D:\android\Smack\.gradle\4.4.1\taskHistory\taskHistory.bin, access org.gradle.cache.internal.DefaultCacheAccess@144d133
Creating new cache for outputFiles, path D:\android\Smack\.gradle\buildOutputCleanup\outputFiles.bin, access org.gradle.cache.internal.DefaultCacheAccess@43dfa5ba
:smack-core:createVersionResource (Thread[Task worker for ':',5,main]) started.

> Task :smack-core:createVersionResource UP-TO-DATE
Putting task artifact state for task ':smack-core:createVersionResource' into context took 0.0 secs.
Skipping task ':smack-core:createVersionResource' as it is up-to-date (took 0.0 secs).

:smack-core:createVersionResource (Thread[Task worker for ':',5,main]) completed. Took 0.027 secs.
:smack-core:compileJava (Thread[Task worker for ':',5,main]) started.

> Task :smack-core:compileJava UP-TO-DATE
Putting task artifact state for task ':smack-core:compileJava' into context took 0.0 secs.
Skipping task ':smack-core:compileJava' as it is up-to-date (took 0.034 secs).

:smack-core:compileJava (Thread[Task worker for ':',5,main]) completed. Took 0.035 secs.
:smack-core:processResources (Thread[Task worker for ':',5,main]) started.

> Task :smack-core:processResources UP-TO-DATE
Putting task artifact state for task ':smack-core:processResources' into context took 0.0 secs.
Skipping task ':smack-core:processResources' as it is up-to-date (took 0.001 secs).

:smack-core:processResources (Thread[Task worker for ':',5,main]) completed. Took 0.001 secs.
:smack-core:classes (Thread[Task worker for ':',5,main]) started.

> Task :smack-core:classes UP-TO-DATE
Skipping task ':smack-core:classes' as it has no actions.

:smack-core:classes (Thread[Task worker for ':',5,main]) completed. Took 0.0 secs.
:smack-core:osgiClasses (Thread[Task worker for ':',5,main]) started.

> Task :smack-core:osgiClasses UP-TO-DATE
Putting task artifact state for task ':smack-core:osgiClasses' into context took 0.0 secs.
Skipping task ':smack-core:osgiClasses' as it is up-to-date (took 0.011 secs).

:smack-core:osgiClasses (Thread[Task worker for ':',5,main]) completed. Took 0.013 secs.
:smack-core:jar (Thread[Task worker for ':',5,main]) started.

> Task :smack-core:jar UP-TO-DATE
Putting task artifact state for task ':smack-core:jar' into context took 0.0 secs.
Skipping task ':smack-core:jar' as it is up-to-date (took 0.099 secs).

:smack-core:jar (Thread[Task worker for ':',5,main]) completed. Took 0.101 secs.
:smack-im:compileJava (Thread[Task worker for ':',5,main]) started.

> Task :smack-im:compileJava UP-TO-DATE
Putting task artifact state for task ':smack-im:compileJava' into context took 0.0 secs.
Skipping task ':smack-im:compileJava' as it is up-to-date (took 0.008 secs).

:smack-im:compileJava (Thread[Task worker for ':',5,main]) completed. Took 0.01 secs.
:smack-im:processResources (Thread[Task worker for ':',5,main]) started.

> Task :smack-im:processResources UP-TO-DATE
Putting task artifact state for task ':smack-im:processResources' into context took 0.0 secs.
Skipping task ':smack-im:processResources' as it is up-to-date (took 0.0 secs).

:smack-im:processResources (Thread[Task worker for ':',5,main]) completed. Took 0.001 secs.
:smack-im:classes (Thread[Task worker for ':',5,main]) started.

> Task :smack-im:classes UP-TO-DATE
Skipping task ':smack-im:classes' as it has no actions.

:smack-im:classes (Thread[Task worker for ':',5,main]) completed. Took 0.0 secs.
:smack-im:osgiClasses (Thread[Task worker for ':',5,main]) started.

> Task :smack-im:osgiClasses UP-TO-DATE
Putting task artifact state for task ':smack-im:osgiClasses' into context took 0.0 secs.
Skipping task ':smack-im:osgiClasses' as it is up-to-date (took 0.002 secs).

:smack-im:osgiClasses (Thread[Task worker for ':',5,main]) completed. Took 0.004 secs.
:smack-im:jar (Thread[Task worker for ':',5,main]) started.

> Task :smack-im:jar UP-TO-DATE
Putting task artifact state for task ':smack-im:jar' into context took 0.0 secs.
Skipping task ':smack-im:jar' as it is up-to-date (took 0.014 secs).

:smack-im:jar (Thread[Task worker for ':',5,main]) completed. Took 0.015 secs.
:smack-resolver-minidns:compileJava (Thread[Task worker for ':',5,main]) started.

> Task :smack-resolver-minidns:compileJava UP-TO-DATE
Putting task artifact state for task ':smack-resolver-minidns:compileJava' into context took 0.0 secs.
Creating new cache for metadata-2.36/module-versions, path C:\Users\aang\.gradle\caches\modules-2\metadata-2.36\module-versions.bin, access org.gradle.cache.internal.DefaultCacheAccess@755fc975
Skipping task ':smack-resolver-minidns:compileJava' as it is up-to-date (took 0.009 secs).

:smack-resolver-minidns:compileJava (Thread[Task worker for ':',5,main]) completed. Took 0.011 secs.
:smack-resolver-minidns:processResources (Thread[Task worker for ':',5,main]) started.

> Task :smack-resolver-minidns:processResources NO-SOURCE
Putting task artifact state for task ':smack-resolver-minidns:processResources' into context took 0.0 secs.
file or directory 'D:\android\Smack\smack-resolver-minidns\src\main\resources', not found
Skipping task ':smack-resolver-minidns:processResources' as it has no source files and no previous output files.

:smack-resolver-minidns:processResources (Thread[Task worker for ':',5,main]) completed. Took 0.0 secs.
:smack-resolver-minidns:classes (Thread[Task worker for ':',5,main]) started.

> Task :smack-resolver-minidns:classes UP-TO-DATE
Skipping task ':smack-resolver-minidns:classes' as it has no actions.

:smack-resolver-minidns:classes (Thread[Task worker for ':',5,main]) completed. Took 0.0 secs.
:smack-resolver-minidns:osgiClasses (Thread[Task worker for ':',5,main]) started.

> Task :smack-resolver-minidns:osgiClasses UP-TO-DATE
Putting task artifact state for task ':smack-resolver-minidns:osgiClasses' into context took 0.0 secs.
Skipping task ':smack-resolver-minidns:osgiClasses' as it is up-to-date (took 0.001 secs).

:smack-resolver-minidns:osgiClasses (Thread[Task worker for ':',5,main]) completed. Took 0.003 secs.
:smack-resolver-minidns:jar (Thread[Task worker for ':',5,main]) started.

> Task :smack-resolver-minidns:jar UP-TO-DATE
Putting task artifact state for task ':smack-resolver-minidns:jar' into context took 0.0 secs.
Skipping task ':smack-resolver-minidns:jar' as it is up-to-date (took 0.009 secs).

:smack-resolver-minidns:jar (Thread[Task worker for ':',5,main]) completed. Took 0.011 secs.
:smack-sasl-provided:compileJava (Thread[Task worker for ':',5,main]) started.

> Task :smack-sasl-provided:compileJava UP-TO-DATE
Putting task artifact state for task ':smack-sasl-provided:compileJava' into context took 0.0 secs.
Skipping task ':smack-sasl-provided:compileJava' as it is up-to-date (took 0.005 secs).

:smack-sasl-provided:compileJava (Thread[Task worker for ':',5,main]) completed. Took 0.006 secs.
:smack-sasl-provided:processResources (Thread[Task worker for ':',5,main]) started.

> Task :smack-sasl-provided:processResources NO-SOURCE
Putting task artifact state for task ':smack-sasl-provided:processResources' into context took 0.0 secs.
file or directory 'D:\android\Smack\smack-sasl-provided\src\main\resources', not found
Skipping task ':smack-sasl-provided:processResources' as it has no source files and no previous output files.

:smack-sasl-provided:processResources (Thread[Task worker for ':',5,main]) completed. Took 0.0 secs.
:smack-sasl-provided:classes (Thread[Task worker for ':',5,main]) started.

> Task :smack-sasl-provided:classes UP-TO-DATE
Skipping task ':smack-sasl-provided:classes' as it has no actions.

:smack-sasl-provided:classes (Thread[Task worker for ':',5,main]) completed. Took 0.0 secs.
:smack-sasl-provided:osgiClasses (Thread[Task worker for ':',5,main]) started.

> Task :smack-sasl-provided:osgiClasses UP-TO-DATE
Putting task artifact state for task ':smack-sasl-provided:osgiClasses' into context took 0.0 secs.
Skipping task ':smack-sasl-provided:osgiClasses' as it is up-to-date (took 0.001 secs).

:smack-sasl-provided:osgiClasses (Thread[Task worker for ':',5,main]) completed. Took 0.003 secs.
:smack-sasl-provided:jar (Thread[Task worker for ':',5,main]) started.

> Task :smack-sasl-provided:jar UP-TO-DATE
Putting task artifact state for task ':smack-sasl-provided:jar' into context took 0.0 secs.
Skipping task ':smack-sasl-provided:jar' as it is up-to-date (took 0.007 secs).

:smack-sasl-provided:jar (Thread[Task worker for ':',5,main]) completed. Took 0.008 secs.
:smack-android:compileJava (Thread[Task worker for ':',5,main]) started.

> Task :smack-android:compileJava UP-TO-DATE
Putting task artifact state for task ':smack-android:compileJava' into context took 0.0 secs.
Skipping task ':smack-android:compileJava' as it is up-to-date (took 0.01 secs).

:smack-android:compileJava (Thread[Task worker for ':',5,main]) completed. Took 0.011 secs.
:smack-android:processResources (Thread[Task worker for ':',5,main]) started.

> Task :smack-android:processResources NO-SOURCE
Putting task artifact state for task ':smack-android:processResources' into context took 0.0 secs.
file or directory 'D:\android\Smack\smack-android\src\main\resources', not found
Skipping task ':smack-android:processResources' as it has no source files and no previous output files.

:smack-android:processResources (Thread[Task worker for ':',5,main]) completed. Took 0.0 secs.
:smack-android:classes (Thread[Task worker for ':',5,main]) started.

> Task :smack-android:classes UP-TO-DATE
Skipping task ':smack-android:classes' as it has no actions.

:smack-android:classes (Thread[Task worker for ':',5,main]) completed. Took 0.0 secs.
:smack-android:osgiClasses (Thread[Task worker for ':',5,main]) started.

> Task :smack-android:osgiClasses UP-TO-DATE
Putting task artifact state for task ':smack-android:osgiClasses' into context took 0.0 secs.
Skipping task ':smack-android:osgiClasses' as it is up-to-date (took 0.002 secs).

:smack-android:osgiClasses (Thread[Task worker for ':',5,main]) completed. Took 0.003 secs.
:smack-android:jar (Thread[Task worker for ':',5,main]) started.

> Task :smack-android:jar UP-TO-DATE
Putting task artifact state for task ':smack-android:jar' into context took 0.0 secs.
Skipping task ':smack-android:jar' as it is up-to-date (took 0.017 secs).

:smack-android:jar (Thread[Task worker for ':',5,main]) completed. Took 0.018 secs.
:smack-core:javadoc (Thread[Task worker for ':',5,main]) started.

> Task :smack-core:javadoc UP-TO-DATE
Putting task artifact state for task ':smack-core:javadoc' into context took 0.0 secs.
Skipping task ':smack-core:javadoc' as it is up-to-date (took 0.015 secs).

:smack-core:javadoc (Thread[Task worker for ':',5,main]) completed. Took 0.016 secs.
:smack-im:javadoc (Thread[Task worker for ':',5,main]) started.

> Task :smack-im:javadoc UP-TO-DATE
Putting task artifact state for task ':smack-im:javadoc' into context took 0.0 secs.
Skipping task ':smack-im:javadoc' as it is up-to-date (took 0.006 secs).

:smack-im:javadoc (Thread[Task worker for ':',5,main]) completed. Took 0.007 secs.
:smack-resolver-minidns:javadoc (Thread[Task worker for ':',5,main]) started.

> Task :smack-resolver-minidns:javadoc UP-TO-DATE
Putting task artifact state for task ':smack-resolver-minidns:javadoc' into context took 0.0 secs.
Skipping task ':smack-resolver-minidns:javadoc' as it is up-to-date (took 0.003 secs).

:smack-resolver-minidns:javadoc (Thread[Task worker for ':',5,main]) completed. Took 0.005 secs.
:smack-sasl-provided:javadoc (Thread[Task worker for ':',5,main]) started.

> Task :smack-sasl-provided:javadoc UP-TO-DATE
Putting task artifact state for task ':smack-sasl-provided:javadoc' into context took 0.0 secs.
Skipping task ':smack-sasl-provided:javadoc' as it is up-to-date (took 0.002 secs).

:smack-sasl-provided:javadoc (Thread[Task worker for ':',5,main]) completed. Took 0.004 secs.
:smack-android:javadoc (Thread[Task worker for ':',5,main]) started.

> Task :smack-android:javadoc UP-TO-DATE
Putting task artifact state for task ':smack-android:javadoc' into context took 0.0 secs.
Skipping task ':smack-android:javadoc' as it is up-to-date (took 0.005 secs).

:smack-android:javadoc (Thread[Task worker for ':',5,main]) completed. Took 0.006 secs.
:smack-android:javadocJar (Thread[Task worker for ':',5,main]) started.

> Task :smack-android:javadocJar UP-TO-DATE
Putting task artifact state for task ':smack-android:javadocJar' into context took 0.0 secs.
Skipping task ':smack-android:javadocJar' as it is up-to-date (took 0.0 secs).

:smack-android:javadocJar (Thread[Task worker for ':',5,main]) completed. Took 0.001 secs.
:smack-android:sourcesJar (Thread[Task worker for ':',5,main]) started.

> Task :smack-android:sourcesJar UP-TO-DATE
Putting task artifact state for task ':smack-android:sourcesJar' into context took 0.0 secs.
file or directory 'D:\android\Smack\smack-android\src\main\resources', not found
file or directory 'D:\android\Smack\smack-android\src\main\resources', not found
Skipping task ':smack-android:sourcesJar' as it is up-to-date (took 0.003 secs).

:smack-android:sourcesJar (Thread[Task worker for ':',5,main]) completed. Took 0.005 secs.
:smack-android:compileTestJava (Thread[Task worker for ':',5,main]) started.

> Task :smack-android:compileTestJava NO-SOURCE
Putting task artifact state for task ':smack-android:compileTestJava' into context took 0.0 secs.
file or directory 'D:\android\Smack\smack-android\src\test\java', not found
Skipping task ':smack-android:compileTestJava' as it has no source files and no previous output files.

:smack-android:compileTestJava (Thread[Task worker for ':',5,main]) completed. Took 0.0 secs.
:smack-android:processTestResources (Thread[Task worker for ':',5,main]) started.

> Task :smack-android:processTestResources NO-SOURCE
Putting task artifact state for task ':smack-android:processTestResources' into context took 0.0 secs.
file or directory 'D:\android\Smack\smack-android\src\test\resources', not found
Skipping task ':smack-android:processTestResources' as it has no source files and no previous output files.

:smack-android:processTestResources (Thread[Task worker for ':',5,main]) completed. Took 0.0 secs.
:smack-android:testClasses (Thread[Task worker for ':',5,main]) started.

> Task :smack-android:testClasses UP-TO-DATE
Skipping task ':smack-android:testClasses' as it has no actions.

:smack-android:testClasses (Thread[Task worker for ':',5,main]) completed. Took 0.0 secs.
:smack-android:testJar (Thread[Task worker for ':',5,main]) started.

> Task :smack-android:testJar UP-TO-DATE
Putting task artifact state for task ':smack-android:testJar' into context took 0.0 secs.
Skipping task ':smack-android:testJar' as it is up-to-date (took 0.001 secs).

:smack-android:testJar (Thread[Task worker for ':',5,main]) completed. Took 0.001 secs.
:smack-android:signArchives (Thread[Task worker for ':',5,main]) started.

> Task :smack-android:signArchives SKIPPED
Skipping task ':smack-android:signArchives' as task onlyIf is false.

:smack-android:signArchives (Thread[Task worker for ':',5,main]) completed. Took 0.0 secs.
:smack-android:install (Thread[Task worker for ':',5,main]) started.

> Task :smack-android:install 
Putting task artifact state for task ':smack-android:install' into context took 0.0 secs.
Up-to-date check for task ':smack-android:install' took 0.0 secs. It is not up-to-date because:
  Task has not declared any outputs.
Publishing configuration: configuration ':smack-android:archives'
Publishing to org.gradle.api.publication.maven.internal.deployer.BaseMavenInstaller@2389dfee

:smack-android:install (Thread[Task worker for ':',5,main]) completed. Took 0.106 secs.
:smack-extensions:compileJava (Thread[Task worker for ':',5,main]) started.

> Task :smack-extensions:compileJava UP-TO-DATE
Putting task artifact state for task ':smack-extensions:compileJava' into context took 0.0 secs.
Skipping task ':smack-extensions:compileJava' as it is up-to-date (took 0.109 secs).

:smack-extensions:compileJava (Thread[Task worker for ':',5,main]) completed. Took 0.111 secs.
:smack-extensions:processResources (Thread[Task worker for ':',5,main]) started.

> Task :smack-extensions:processResources UP-TO-DATE
Putting task artifact state for task ':smack-extensions:processResources' into context took 0.0 secs.
Skipping task ':smack-extensions:processResources' as it is up-to-date (took 0.0 secs).

:smack-extensions:processResources (Thread[Task worker for ':',5,main]) completed. Took 0.001 secs.
:smack-extensions:classes (Thread[Task worker for ':',5,main]) started.

> Task :smack-extensions:classes UP-TO-DATE
Skipping task ':smack-extensions:classes' as it has no actions.

:smack-extensions:classes (Thread[Task worker for ':',5,main]) completed. Took 0.0 secs.
:smack-extensions:osgiClasses (Thread[Task worker for ':',5,main]) started.

> Task :smack-extensions:osgiClasses UP-TO-DATE
Putting task artifact state for task ':smack-extensions:osgiClasses' into context took 0.0 secs.
Skipping task ':smack-extensions:osgiClasses' as it is up-to-date (took 0.048 secs).

:smack-extensions:osgiClasses (Thread[Task worker for ':',5,main]) completed. Took 0.049 secs.
:smack-extensions:jar (Thread[Task worker for ':',5,main]) started.

> Task :smack-extensions:jar UP-TO-DATE
Putting task artifact state for task ':smack-extensions:jar' into context took 0.0 secs.
Skipping task ':smack-extensions:jar' as it is up-to-date (took 0.13 secs).

:smack-extensions:jar (Thread[Task worker for ':',5,main]) completed. Took 0.131 secs.
:smack-android-extensions:compileJava (Thread[Task worker for ':',5,main]) started.

> Task :smack-android-extensions:compileJava UP-TO-DATE
Putting task artifact state for task ':smack-android-extensions:compileJava' into context took 0.0 secs.
Skipping task ':smack-android-extensions:compileJava' as it is up-to-date (took 0.006 secs).

:smack-android-extensions:compileJava (Thread[Task worker for ':',5,main]) completed. Took 0.007 secs.
:smack-android-extensions:processResources (Thread[Task worker for ':',5,main]) started.

> Task :smack-android-extensions:processResources NO-SOURCE
Putting task artifact state for task ':smack-android-extensions:processResources' into context took 0.0 secs.
file or directory 'D:\android\Smack\smack-android-extensions\src\main\resources', not found
Skipping task ':smack-android-extensions:processResources' as it has no source files and no previous output files.

:smack-android-extensions:processResources (Thread[Task worker for ':',5,main]) completed. Took 0.0 secs.
:smack-android-extensions:classes (Thread[Task worker for ':',5,main]) started.

> Task :smack-android-extensions:classes UP-TO-DATE
Skipping task ':smack-android-extensions:classes' as it has no actions.

:smack-android-extensions:classes (Thread[Task worker for ':',5,main]) completed. Took 0.0 secs.
:smack-android-extensions:osgiClasses (Thread[Task worker for ':',5,main]) started.

> Task :smack-android-extensions:osgiClasses UP-TO-DATE
Putting task artifact state for task ':smack-android-extensions:osgiClasses' into context took 0.0 secs.
Skipping task ':smack-android-extensions:osgiClasses' as it is up-to-date (took 0.001 secs).

:smack-android-extensions:osgiClasses (Thread[Task worker for ':',5,main]) completed. Took 0.002 secs.
:smack-android-extensions:jar (Thread[Task worker for ':',5,main]) started.

> Task :smack-android-extensions:jar UP-TO-DATE
Putting task artifact state for task ':smack-android-extensions:jar' into context took 0.0 secs.
Skipping task ':smack-android-extensions:jar' as it is up-to-date (took 0.017 secs).

:smack-android-extensions:jar (Thread[Task worker for ':',5,main]) completed. Took 0.019 secs.
:smack-extensions:javadoc (Thread[Task worker for ':',5,main]) started.

> Task :smack-extensions:javadoc UP-TO-DATE
Putting task artifact state for task ':smack-extensions:javadoc' into context took 0.0 secs.
Skipping task ':smack-extensions:javadoc' as it is up-to-date (took 0.09 secs).

:smack-extensions:javadoc (Thread[Task worker for ':',5,main]) completed. Took 0.091 secs.
:smack-android-extensions:javadoc (Thread[Task worker for ':',5,main]) started.

> Task :smack-android-extensions:javadoc UP-TO-DATE
Putting task artifact state for task ':smack-android-extensions:javadoc' into context took 0.0 secs.
Skipping task ':smack-android-extensions:javadoc' as it is up-to-date (took 0.003 secs).

:smack-android-extensions:javadoc (Thread[Task worker for ':',5,main]) completed. Took 0.004 secs.
:smack-android-extensions:javadocJar (Thread[Task worker for ':',5,main]) started.

> Task :smack-android-extensions:javadocJar UP-TO-DATE
Putting task artifact state for task ':smack-android-extensions:javadocJar' into context took 0.0 secs.
Skipping task ':smack-android-extensions:javadocJar' as it is up-to-date (took 0.0 secs).

:smack-android-extensions:javadocJar (Thread[Task worker for ':',5,main]) completed. Took 0.001 secs.
:smack-android-extensions:sourcesJar (Thread[Task worker for ':',5,main]) started.

> Task :smack-android-extensions:sourcesJar UP-TO-DATE
Putting task artifact state for task ':smack-android-extensions:sourcesJar' into context took 0.0 secs.
file or directory 'D:\android\Smack\smack-android-extensions\src\main\resources', not found
file or directory 'D:\android\Smack\smack-android-extensions\src\main\resources', not found
Skipping task ':smack-android-extensions:sourcesJar' as it is up-to-date (took 0.002 secs).

:smack-android-extensions:sourcesJar (Thread[Task worker for ':',5,main]) completed. Took 0.003 secs.
:smack-android-extensions:compileTestJava (Thread[Task worker for ':',5,main]) started.

> Task :smack-android-extensions:compileTestJava NO-SOURCE
Putting task artifact state for task ':smack-android-extensions:compileTestJava' into context took 0.0 secs.
file or directory 'D:\android\Smack\smack-android-extensions\src\test\java', not found
Skipping task ':smack-android-extensions:compileTestJava' as it has no source files and no previous output files.

:smack-android-extensions:compileTestJava (Thread[Task worker for ':',5,main]) completed. Took 0.0 secs.
:smack-android-extensions:processTestResources (Thread[Task worker for ':',5,main]) started.

> Task :smack-android-extensions:processTestResources NO-SOURCE
Putting task artifact state for task ':smack-android-extensions:processTestResources' into context took 0.0 secs.
file or directory 'D:\android\Smack\smack-android-extensions\src\test\resources', not found
Skipping task ':smack-android-extensions:processTestResources' as it has no source files and no previous output files.

:smack-android-extensions:processTestResources (Thread[Task worker for ':',5,main]) completed. Took 0.0 secs.
:smack-android-extensions:testClasses (Thread[Task worker for ':',5,main]) started.

> Task :smack-android-extensions:testClasses UP-TO-DATE
Skipping task ':smack-android-extensions:testClasses' as it has no actions.

:smack-android-extensions:testClasses (Thread[Task worker for ':',5,main]) completed. Took 0.0 secs.
:smack-android-extensions:testJar (Thread[Task worker for ':',5,main]) started.

> Task :smack-android-extensions:testJar UP-TO-DATE
Putting task artifact state for task ':smack-android-extensions:testJar' into context took 0.0 secs.
Skipping task ':smack-android-extensions:testJar' as it is up-to-date (took 0.0 secs).

:smack-android-extensions:testJar (Thread[Task worker for ':',5,main]) completed. Took 0.001 secs.
:smack-android-extensions:signArchives (Thread[Task worker for ':',5,main]) started.

> Task :smack-android-extensions:signArchives SKIPPED
Skipping task ':smack-android-extensions:signArchives' as task onlyIf is false.

:smack-android-extensions:signArchives (Thread[Task worker for ':',5,main]) completed. Took 0.0 secs.
:smack-android-extensions:install (Thread[Task worker for ':',5,main]) started.

> Task :smack-android-extensions:install 
Putting task artifact state for task ':smack-android-extensions:install' into context took 0.0 secs.
Up-to-date check for task ':smack-android-extensions:install' took 0.0 secs. It is not up-to-date because:
  Task has not declared any outputs.
Publishing configuration: configuration ':smack-android-extensions:archives'
Publishing to org.gradle.api.publication.maven.internal.deployer.BaseMavenInstaller@5dc6a0b4

:smack-android-extensions:install (Thread[Task worker for ':',5,main]) completed. Took 0.035 secs.
:smack-bosh:compileJava (Thread[Task worker for ':',5,main]) started.

> Task :smack-bosh:compileJava 
Putting task artifact state for task ':smack-bosh:compileJava' into context took 0.0 secs.
Creating new cache for metadata-2.36/resource-at-url, path C:\Users\aang\.gradle\caches\modules-2\metadata-2.36\resource-at-url.bin, access org.gradle.cache.internal.DefaultCacheAccess@755fc975
Resource missing. [HTTP GET: https://oss.sonatype.org/content/repositories/snapshots/org/igniterealtime/jbosh/jbosh/0.9.0-SNAPSHOT/maven-metadata.xml]
Resource missing. [HTTP GET: https://oss.sonatype.org/content/repositories/snapshots/org/igniterealtime/jbosh/jbosh/0.9.0-SNAPSHOT/jbosh-0.9.0-SNAPSHOT.pom]
Resource missing. [HTTP HEAD: https://oss.sonatype.org/content/repositories/snapshots/org/igniterealtime/jbosh/jbosh/0.9.0-SNAPSHOT/jbosh-0.9.0-SNAPSHOT.jar]
Skipping task ':smack-bosh:compileJava' as it is up-to-date (took 2.755 secs).

:smack-bosh:compileJava (Thread[Task worker for ':',5,main]) completed. Took 2.756 secs.
:smack-bosh:processResources (Thread[Task worker for ':',5,main]) started.

> Task :smack-bosh:processResources NO-SOURCE
Putting task artifact state for task ':smack-bosh:processResources' into context took 0.0 secs.
file or directory 'D:\android\Smack\smack-bosh\src\main\resources', not found
Skipping task ':smack-bosh:processResources' as it has no source files and no previous output files.

:smack-bosh:processResources (Thread[Task worker for ':',5,main]) completed. Took 0.0 secs.
:smack-bosh:classes (Thread[Task worker for ':',5,main]) started.

> Task :smack-bosh:classes UP-TO-DATE
Skipping task ':smack-bosh:classes' as it has no actions.

:smack-bosh:classes (Thread[Task worker for ':',5,main]) completed. Took 0.0 secs.
:smack-bosh:osgiClasses (Thread[Task worker for ':',5,main]) started.

> Task :smack-bosh:osgiClasses UP-TO-DATE
Putting task artifact state for task ':smack-bosh:osgiClasses' into context took 0.0 secs.
Skipping task ':smack-bosh:osgiClasses' as it is up-to-date (took 0.0 secs).

:smack-bosh:osgiClasses (Thread[Task worker for ':',5,main]) completed. Took 0.001 secs.
:smack-bosh:jar (Thread[Task worker for ':',5,main]) started.

> Task :smack-bosh:jar UP-TO-DATE
Putting task artifact state for task ':smack-bosh:jar' into context took 0.0 secs.
Skipping task ':smack-bosh:jar' as it is up-to-date (took 0.019 secs).

:smack-bosh:jar (Thread[Task worker for ':',5,main]) completed. Took 0.02 secs.
:smack-bosh:javadoc (Thread[Task worker for ':',5,main]) started.

> Task :smack-bosh:javadoc UP-TO-DATE
Putting task artifact state for task ':smack-bosh:javadoc' into context took 0.0 secs.
Skipping task ':smack-bosh:javadoc' as it is up-to-date (took 0.007 secs).

:smack-bosh:javadoc (Thread[Task worker for ':',5,main]) completed. Took 0.008 secs.
:smack-bosh:javadocJar (Thread[Task worker for ':',5,main]) started.

> Task :smack-bosh:javadocJar UP-TO-DATE
Putting task artifact state for task ':smack-bosh:javadocJar' into context took 0.0 secs.
Skipping task ':smack-bosh:javadocJar' as it is up-to-date (took 0.0 secs).

:smack-bosh:javadocJar (Thread[Task worker for ':',5,main]) completed. Took 0.001 secs.
:smack-bosh:sourcesJar (Thread[Task worker for ':',5,main]) started.

> Task :smack-bosh:sourcesJar UP-TO-DATE
Putting task artifact state for task ':smack-bosh:sourcesJar' into context took 0.0 secs.
file or directory 'D:\android\Smack\smack-bosh\src\main\resources', not found
file or directory 'D:\android\Smack\smack-bosh\src\main\resources', not found
Skipping task ':smack-bosh:sourcesJar' as it is up-to-date (took 0.001 secs).

:smack-bosh:sourcesJar (Thread[Task worker for ':',5,main]) completed. Took 0.002 secs.
:smack-bosh:compileTestJava (Thread[Task worker for ':',5,main]) started.

> Task :smack-bosh:compileTestJava NO-SOURCE
Putting task artifact state for task ':smack-bosh:compileTestJava' into context took 0.0 secs.
file or directory 'D:\android\Smack\smack-bosh\src\test\java', not found
Skipping task ':smack-bosh:compileTestJava' as it has no source files and no previous output files.

:smack-bosh:compileTestJava (Thread[Task worker for ':',5,main]) completed. Took 0.0 secs.
:smack-bosh:processTestResources (Thread[Task worker for ':',5,main]) started.

> Task :smack-bosh:processTestResources NO-SOURCE
Putting task artifact state for task ':smack-bosh:processTestResources' into context took 0.0 secs.
file or directory 'D:\android\Smack\smack-bosh\src\test\resources', not found
Skipping task ':smack-bosh:processTestResources' as it has no source files and no previous output files.

:smack-bosh:processTestResources (Thread[Task worker for ':',5,main]) completed. Took 0.0 secs.
:smack-bosh:testClasses (Thread[Task worker for ':',5,main]) started.

> Task :smack-bosh:testClasses UP-TO-DATE
Skipping task ':smack-bosh:testClasses' as it has no actions.

:smack-bosh:testClasses (Thread[Task worker for ':',5,main]) completed. Took 0.0 secs.
:smack-bosh:testJar (Thread[Task worker for ':',5,main]) started.

> Task :smack-bosh:testJar UP-TO-DATE
Putting task artifact state for task ':smack-bosh:testJar' into context took 0.0 secs.
Skipping task ':smack-bosh:testJar' as it is up-to-date (took 0.0 secs).

:smack-bosh:testJar (Thread[Task worker for ':',5,main]) completed. Took 0.001 secs.
:smack-bosh:signArchives (Thread[Task worker for ':',5,main]) started.

> Task :smack-bosh:signArchives SKIPPED
Skipping task ':smack-bosh:signArchives' as task onlyIf is false.

:smack-bosh:signArchives (Thread[Task worker for ':',5,main]) completed. Took 0.0 secs.
:smack-bosh:install (Thread[Task worker for ':',5,main]) started.

> Task :smack-bosh:install 
Putting task artifact state for task ':smack-bosh:install' into context took 0.0 secs.
Up-to-date check for task ':smack-bosh:install' took 0.0 secs. It is not up-to-date because:
  Task has not declared any outputs.
Publishing configuration: configuration ':smack-bosh:archives'
Publishing to org.gradle.api.publication.maven.internal.deployer.BaseMavenInstaller@65d43fce

:smack-bosh:install (Thread[Task worker for ':',5,main]) completed. Took 0.026 secs.
:smack-compression-jzlib:compileJava (Thread[Task worker for ':',5,main]) started.

> Task :smack-compression-jzlib:compileJava UP-TO-DATE
Putting task artifact state for task ':smack-compression-jzlib:compileJava' into context took 0.0 secs.
Skipping task ':smack-compression-jzlib:compileJava' as it is up-to-date (took 0.005 secs).

:smack-compression-jzlib:compileJava (Thread[Task worker for ':',5,main]) completed. Took 0.008 secs.
:smack-compression-jzlib:processResources (Thread[Task worker for ':',5,main]) started.

> Task :smack-compression-jzlib:processResources NO-SOURCE
Putting task artifact state for task ':smack-compression-jzlib:processResources' into context took 0.0 secs.
file or directory 'D:\android\Smack\smack-compression-jzlib\src\main\resources', not found
Skipping task ':smack-compression-jzlib:processResources' as it has no source files and no previous output files.

:smack-compression-jzlib:processResources (Thread[Task worker for ':',5,main]) completed. Took 0.0 secs.
:smack-compression-jzlib:classes (Thread[Task worker for ':',5,main]) started.

> Task :smack-compression-jzlib:classes UP-TO-DATE
Skipping task ':smack-compression-jzlib:classes' as it has no actions.

:smack-compression-jzlib:classes (Thread[Task worker for ':',5,main]) completed. Took 0.0 secs.
:smack-compression-jzlib:osgiClasses (Thread[Task worker for ':',5,main]) started.

> Task :smack-compression-jzlib:osgiClasses UP-TO-DATE
Putting task artifact state for task ':smack-compression-jzlib:osgiClasses' into context took 0.0 secs.
Skipping task ':smack-compression-jzlib:osgiClasses' as it is up-to-date (took 0.001 secs).

:smack-compression-jzlib:osgiClasses (Thread[Task worker for ':',5,main]) completed. Took 0.002 secs.
:smack-compression-jzlib:jar (Thread[Task worker for ':',5,main]) started.

> Task :smack-compression-jzlib:jar UP-TO-DATE
Putting task artifact state for task ':smack-compression-jzlib:jar' into context took 0.0 secs.
Skipping task ':smack-compression-jzlib:jar' as it is up-to-date (took 0.007 secs).

:smack-compression-jzlib:jar (Thread[Task worker for ':',5,main]) completed. Took 0.009 secs.
:smack-compression-jzlib:javadoc (Thread[Task worker for ':',5,main]) started.

> Task :smack-compression-jzlib:javadoc UP-TO-DATE
Putting task artifact state for task ':smack-compression-jzlib:javadoc' into context took 0.0 secs.
Skipping task ':smack-compression-jzlib:javadoc' as it is up-to-date (took 0.003 secs).

:smack-compression-jzlib:javadoc (Thread[Task worker for ':',5,main]) completed. Took 0.005 secs.
:smack-compression-jzlib:javadocJar (Thread[Task worker for ':',5,main]) started.

> Task :smack-compression-jzlib:javadocJar UP-TO-DATE
Putting task artifact state for task ':smack-compression-jzlib:javadocJar' into context took 0.0 secs.
Skipping task ':smack-compression-jzlib:javadocJar' as it is up-to-date (took 0.0 secs).

:smack-compression-jzlib:javadocJar (Thread[Task worker for ':',5,main]) completed. Took 0.001 secs.
:smack-compression-jzlib:sourcesJar (Thread[Task worker for ':',5,main]) started.

> Task :smack-compression-jzlib:sourcesJar UP-TO-DATE
Putting task artifact state for task ':smack-compression-jzlib:sourcesJar' into context took 0.0 secs.
file or directory 'D:\android\Smack\smack-compression-jzlib\src\main\resources', not found
file or directory 'D:\android\Smack\smack-compression-jzlib\src\main\resources', not found
Skipping task ':smack-compression-jzlib:sourcesJar' as it is up-to-date (took 0.001 secs).

:smack-compression-jzlib:sourcesJar (Thread[Task worker for ':',5,main]) completed. Took 0.003 secs.
:smack-compression-jzlib:compileTestJava (Thread[Task worker for ':',5,main]) started.

> Task :smack-compression-jzlib:compileTestJava NO-SOURCE
Putting task artifact state for task ':smack-compression-jzlib:compileTestJava' into context took 0.0 secs.
file or directory 'D:\android\Smack\smack-compression-jzlib\src\test\java', not found
Skipping task ':smack-compression-jzlib:compileTestJava' as it has no source files and no previous output files.

:smack-compression-jzlib:compileTestJava (Thread[Task worker for ':',5,main]) completed. Took 0.0 secs.
:smack-compression-jzlib:processTestResources (Thread[Task worker for ':',5,main]) started.

> Task :smack-compression-jzlib:processTestResources NO-SOURCE
Putting task artifact state for task ':smack-compression-jzlib:processTestResources' into context took 0.0 secs.
file or directory 'D:\android\Smack\smack-compression-jzlib\src\test\resources', not found
Skipping task ':smack-compression-jzlib:processTestResources' as it has no source files and no previous output files.

:smack-compression-jzlib:processTestResources (Thread[Task worker for ':',5,main]) completed. Took 0.0 secs.
:smack-compression-jzlib:testClasses (Thread[Task worker for ':',5,main]) started.

> Task :smack-compression-jzlib:testClasses UP-TO-DATE
Skipping task ':smack-compression-jzlib:testClasses' as it has no actions.

:smack-compression-jzlib:testClasses (Thread[Task worker for ':',5,main]) completed. Took 0.0 secs.
:smack-compression-jzlib:testJar (Thread[Task worker for ':',5,main]) started.

> Task :smack-compression-jzlib:testJar UP-TO-DATE
Putting task artifact state for task ':smack-compression-jzlib:testJar' into context took 0.0 secs.
Skipping task ':smack-compression-jzlib:testJar' as it is up-to-date (took 0.0 secs).

:smack-compression-jzlib:testJar (Thread[Task worker for ':',5,main]) completed. Took 0.001 secs.
:smack-compression-jzlib:signArchives (Thread[Task worker for ':',5,main]) started.

> Task :smack-compression-jzlib:signArchives SKIPPED
Skipping task ':smack-compression-jzlib:signArchives' as task onlyIf is false.

:smack-compression-jzlib:signArchives (Thread[Task worker for ':',5,main]) completed. Took 0.0 secs.
:smack-compression-jzlib:install (Thread[Task worker for ':',5,main]) started.

> Task :smack-compression-jzlib:install 
Putting task artifact state for task ':smack-compression-jzlib:install' into context took 0.0 secs.
Up-to-date check for task ':smack-compression-jzlib:install' took 0.0 secs. It is not up-to-date because:
  Task has not declared any outputs.
Publishing configuration: configuration ':smack-compression-jzlib:archives'
Publishing to org.gradle.api.publication.maven.internal.deployer.BaseMavenInstaller@46e990d0

:smack-compression-jzlib:install (Thread[Task worker for ':',5,main]) completed. Took 0.025 secs.
:smack-core:javadocJar (Thread[Task worker for ':',5,main]) started.

> Task :smack-core:javadocJar UP-TO-DATE
Putting task artifact state for task ':smack-core:javadocJar' into context took 0.0 secs.
Skipping task ':smack-core:javadocJar' as it is up-to-date (took 0.008 secs).

:smack-core:javadocJar (Thread[Task worker for ':',5,main]) completed. Took 0.009 secs.
:smack-core:sourcesJar (Thread[Task worker for ':',5,main]) started.

> Task :smack-core:sourcesJar UP-TO-DATE
Putting task artifact state for task ':smack-core:sourcesJar' into context took 0.0 secs.
Skipping task ':smack-core:sourcesJar' as it is up-to-date (took 0.007 secs).

:smack-core:sourcesJar (Thread[Task worker for ':',5,main]) completed. Took 0.009 secs.
:smack-core:compileTestJava (Thread[Task worker for ':',5,main]) started.

> Task :smack-core:compileTestJava FAILED
Putting task artifact state for task ':smack-core:compileTestJava' into context took 0.0 secs.
Up-to-date check for task ':smack-core:compileTestJava' took 0.041 secs. It is not up-to-date because:
  Task has failed previously.
All input files are considered out-of-date for incremental task ':smack-core:compileTestJava'.
Compiling with error-prone compiler
D:\android\Smack\smack-core\src\test\java\org\jivesoftware\smack\parsing\ParsingExceptionTest.java:19: error: can't find this symbol
import static org.jivesoftware.smack.test.util.CharSequenceEquals.equalsCharSequence;
                                              ^
  Symbol:   class CharSequenceEquals
  position: package org.jivesoftware.smack.test.util
D:\android\Smack\smack-core\src\test\java\org\jivesoftware\smack\parsing\ParsingExceptionTest.java:19: error: Can only do static import from class or interfaces
import static org.jivesoftware.smack.test.util.CharSequenceEquals.equalsCharSequence;
^
2 errors

:smack-core:compileTestJava (Thread[Task worker for ':',5,main]) completed. Took 0.779 secs.

FAILURE: Build failed with an exception.

* What went wrong:
Execution failed for task ':smack-core:compileTestJava'.
> Compilation failed with exit code 1; see the compiler error output for details.

* Try:
Run with --stacktrace option to get the stack trace. Run with --debug option to get more log output. Run with --scan to get full insights.

* Get more help at https://help.gradle.org

BUILD FAILED in 9s
59 actionable tasks: 5 executed, 54 up-to-date

I suspect this has something to do with : https://discuss.gradle.org/t/gradle-eclipse-generates-duplicate-classpathentry-in-eclipses-classpath-with-gradle-2-6/11784/7 but I have no idea how to fix. I am using gradle-4.4.1 to build. Any hint would be helpful.

Thanks.

I think what might be useful are translated error messages (in english) so that everybody can see what’s going on.

Here is the screenshot with translations.

Thanks.

I updated the output i get from the console, hoping to get some insight into this problem.

Hi,

I saw this issue while trying to make the project in Android Studio, having just cloned the project (and having tweaked another couple of things trying to get things working…!).

I still didn’t sort out a good build (I’m on to the next issue now…) but this problem seems superficial - the error message says it all - the class in question is actually defined as “CharsequenceEquals” - lower case S. Changing this in the import seems to have fixed the issue.

Though I’m kind of surprised this bug would get through - is case-sensitivity optional ? Or is it platform specific ? (I’m with Android Studio on Windows).

Hope that helps !

I’m not sure about that. The code is working as is on my machine.
Please open a new post about what you had to change to make smack running :slight_smile:

Well, I didn’t get anything to build, which is why I wasn’t confident with my suggestion. Still, it looked suspicious.
I’ll go and start another thread about my project setup problems, if I can’t find an answer already :slight_smile:

A post was split to a new topic: Why is there a CharSequenceEquals AND CharsequenceEquals class?